water depth measurement
type: Concept
Contributor: dgwr
Created: 2010-12-15T17:27:27Z
creator: dgwr
Modified: 2019-05-09T16:00:18.197+00:00
broader: methods
definition: Measurement of depth of water in stilling well of the flow gauging structure

methods
type: Concept
narrower: water depth measurement

Contributor

Created

Creator

Modified