Creator

Created

Contributor

Modified

dissolved ammonium nitrogen
type: Concept
Contributor: dgwr
Created: 2010-12-10T16:43:17Z
creator: dgwr
Modified: 2019-05-09T16:00:18.197+00:00
alternative label: NH4-N dissolved
broad match: http://onto.nerc.ac.uk/GBASEvocabulary/147
broader: dissolved ammonium
definition: Dissolved ammonium expressed as dissolved nitrogen from ammonium (multiply by 18/14 to convert to ammonium)

dissolved ammonium
type: Concept
narrower: dissolved ammonium nitrogen