Creator

Created

Modified

bulk density measurement
type: Concept
Created: 2017-01-20T15:25:46.762+00:00
creator: dgwr
Modified: 2019-05-09T16:00:18.197+00:00
broader: methods
definition: Determination of property [mass/volume occupied] in soil or sediment samples, derived from measurements of volume and mass with possible corrections for moisture and stone content.
related: top pan balances

methods
type: Concept
narrower: bulk density measurement

top pan balances
type: Concept
related: bulk density measurement