Creator

Created

Contributor

Modified

microsiemens per centimetre at 25 degrees Celsius
type: Concept
Contributor: dgwr
Created: 2010-12-15T15:46:35Z
creator: dgwr
Modified: 2019-05-09T16:00:18.197+00:00
alternative label: uS/cm @ 25C
broader: measurement units
definition: Microsiemens per centimetre normalised to 25 degrees Celsius

measurement units
type: Concept
narrower: microsiemens per centimetre at 25 degrees Celsius