Creator

Created

Contributor

Modified

no units
type: Concept
Contributor: dgwr
Created: 2010-12-15T15:49:01Z
creator: dgwr
Modified: 2019-05-09T16:00:18.197+00:00
alternative label: no
broader: measurement units
definition: No units, as the determinand is dimensionless

measurement units
type: Concept
narrower: no units