Creator

Created

Contributor

Modified

micrograms per gram (wet weight)
type: Concept
Contributor: dgwr
Created: 2012-01-06T16:04:09Z
creator: dgwr
Modified: 2019-05-09T16:00:18.197+00:00
alternative label: µg/g (ww)
alternative label: ug/g (ww)
broader: measurement units
definition: Micrograms of analyte per gram undried mass of sample

measurement units
type: Concept
narrower: micrograms per gram (wet weight)