Creator

Created

Contributor

Modified

nephelometric turbidity units
type: Concept
Contributor: dgwr
Created: 2014-05-29T09:46:39Z
creator: dgwr
Modified: 2019-05-09T16:00:18.197+00:00
alternative label: NTU
broader: measurement units
definition: Nephelometric Turbidity Units. Units for turbidity measured using a nephelometer, where scattered light is measured by a detector placed to the side of a beam of light passing through a sample of water.

measurement units
type: Concept
narrower: nephelometric turbidity units